Regional Employment Rate
type: Property
comment: Rate computed by dividing the number of holders or subjects in the region meeting the data set's criteria of employment (meetEmploymentCriteria) by the number of holders or subjects in the region for which data was available (dataAvailable).
term status: stable
change history: https://credreg.net/qdata/termhistory/qdata/regionalEmploymentRate/json
sub property of: employmentRate
domain includes: DataProfile
range includes: QuantitativeValue