Size of No Data
type: Property
comment: Number of subjects in the sample for which no data was obtained.
description: This is relevant for surveys or other forms of data gathering where a bias may be introduced by non-response or similar omissions.
usage note: For the number of subjects for which data was available, use sizeOfData, and for the total number of subjects available use sizeOfPopulation.
term status: unstable
change history: https://credreg.net/qdata/termhistory/qdata/sizeOfNoData/json
domain includes: Observation
range includes: integer