Subject Excluded
type: Property
comment: Category of subject excluded from the data.
term status: stable
change history: https://credreg.net/qdata/termhistory/qdata/subjectExcluded/json
domain includes: DataProfile
range includes: QuantitativeValue