Subject Value
type: Property
comment: Quantitative values and percentages for a subject category in the data set.
term status: stable
change history: https://credreg.net/qdata/termhistory/qdata/subjectValue/json
range includes: QuantitativeValue