Sufficient Employment Criteria
type: Property
comment: Number of holders that meet the prescribed employment threshold in terms of earnings or time engaged in work as defined for the data set (employmentDefinition).
term status: stable
change history: https://credreg.net/qdata/termhistory/qdata/sufficientEmploymentCriteria/json
domain includes: DataProfile
range includes: QuantitativeValue