Total WIOA Completers
type: Property
comment: Total participants who completed the WIOA program, successfully or unsuccessfully.
term status: stable
change history: https://credreg.net/qdata/termhistory/qdata/totalWIOACompleters/json
domain includes: DataProfile
range includes: QuantitativeValue