Total WIOA Exiters
type: Property
comment: Total participants who successfully completed the WIOA program and exited WIOA.
term status: stable
change history: https://credreg.net/qdata/termhistory/qdata/totalWIOAExiters/json
domain includes: DataProfile
range includes: QuantitativeValue