Administrative Record Matching
type: Concept
definition: Data derived from cross-mapping unambiguous identifiers from more than one government administrative data sets.
term status: stable
change history: https://credreg.net/qdata/termhistory/collectionMethod/AdministrativeRecordMatching/json
in scheme: CollectionMethod
top concept of: CollectionMethod