Supplemental Source
type: Concept
definition: Agent providing data augmenting administrative, self-reported or survey data.
term status: stable
change history: https://credreg.net/qdata/termhistory/collectionMethod/SupplementalSource/json
in scheme: CollectionMethod
top concept of: CollectionMethod