Country
type: Concept
definition: Nation with its own government, occupying a particular territory such as the United States of America, Germany and France.
term status: stable
change history: https://credreg.net/qdata/termhistory/sourceCoverage/Country/json
in scheme: DataSourceCoverage
top concept of: DataSourceCoverage