Urban Area
type: Concept
definition: Urban area that has a name, defined boundaries, and local government such as a city, town, or village.
term status: stable
change history: https://credreg.net/qdata/termhistory/sourceCoverage/UrbanArea/json
in scheme: DataSourceCoverage
top concept of: DataSourceCoverage